{"text_format":"3","workbook":"xlsx","n_sheets":7,"sheets":["Sheet1","分校计划安排表","倾斜专业","职成处公布专业名单","职成处公布院校名单","学校序号","专业超400"],"not_rendered":{"defined_names":6},"read":"whole","date_system":"1900"}

{"sheet":"Sheet1","index":0,"n_rows":238,"n_cols":6,"rows_kept":238,"merged":[[0,0,0,5],[1,0,1,5],[3,0,11,0],[12,0,20,0],[21,0,35,0],[36,0,43,0],[44,0,51,0],[52,0,64,0],[65,0,75,0],[76,0,89,0],[90,0,93,0],[94,0,101,0],[103,0,112,0],[113,0,123,0],[124,0,125,0],[126,0,133,0],[134,0,143,0],[144,0,147,0],[149,0,151,0],[152,0,153,0],[155,0,182,0],[183,0,186,0],[187,0,191,0],[192,0,194,0],[195,0,197,0],[198,0,205,0],[206,0,213,0],[214,0,221,0],[224,0,228,0],[229,0,236,0]]}
["2024年福建省五年制高职教育面向泉州招生计划"]
["  志愿填报步骤：泉州市中考中招信息管理系统→志愿填报→中职本科“3+4”贯通培养、五年制高职常规志愿批次→志愿序号→选填高职院校代码及名称，例如：50012黎明职业大学→选填专业代码、名称及联办中职学校，例如：01市政工程技术（惠安开成职业中专学校）→根据需要继续填报其他志愿→保存、提交。\n  说明：1.根据福建省教育厅相关规定，五年制高职录取最低控制线，原则上不低于我市普通高中录取最低控制分数线下60分；五年制高职教育艺术、体育等特殊专业领域（含艺术设计类、表演艺术类、民族文化类、体育类、公共服务类）招生录取最低控制分数线，原则上不得低于我市普通高中录取最低控制分数线的60%。2.表格中民办院校收费标准为相关院校所提供。"]
["学校代码、名称","专业\n代码","专业名称","“三二分段制”\n中职学校名称","招生人数","备注"]
["黎明职业大学\n（公办高职院校）\n学校代码：50012","01","市政工程技术","惠安开成职业中专学校",45]
[null,"02","机械设计与制造","泉州市泉港区职业中专学校",45]
[null,"03","数控技术","南安职业中专学校",25]
[null,"04","数控技术","永春职业中专学校",25]
[null,"05","服装设计与工艺","晋江职业中专学校",45]
[null,"06","食品检验检测技术","晋江市晋兴职业中专学校",25]
[null,"07","食品检验检测技术","福建经贸学校",25]
[null,"08","动漫制作技术","晋江华侨职业中专学校",45]
[null,"09","旅游管理","泉州市工商旅游职业中专学校",45]
["泉州幼儿师范高等专科学校\n（公办高职院校）\n学校代码：50001","01","休闲服务与管理","晋江华侨职业中专学校",50]
[null,"02","休闲服务与管理","石狮鹏山工贸学校",36]
[null,"03","学前教育","泉州华侨职业中专学校",30]
[null,"04","学前教育","晋江华侨职业中专学校",30]
[null,"05","学前教育","石狮鹏山工贸学校",24]
[null,"06","学前教育","泉州市工商旅游职业中专学校",30]
[null,"07","学前教育","南安职业中专学校",25]
[null,"08","舞蹈教育","泉州艺术学校",15,"须面试"]
[null,"09","艺术教育","泉州艺术学校",15,"须面试"]
["泉州经贸职业技术学院\n（公办高职院校）\n学校代码：50013","01","服装设计与工艺","福建经贸学校",50]
[null,"02","服装设计与工艺","惠安职业中专学校",50]
[null,"03","服装设计与工艺","厦门市集美职业技术学校",5]
[null,"04","汽车检测与维修技术","南安市工业学校",50]
[null,"05","会计信息管理","安溪陈利职业中专学校",50]
[null,"06","会计信息管理","石狮鹏山工贸学校",50]
[null,"07","会计信息管理","南安职业中专学校",50]
[null,"08","统计与会计核算","惠安职业中专学校",50]
[null,"09","统计与会计核算","泉州市农业学校",50]
[null,"10","电子商务","泉州市农业学校",50]
[null,"11","电子商务","南安职业中专学校",50]
[null,"12","现代物流管理","福建经贸学校",50]
[null,"13","现代物流管理","晋江职业中专学校",50]
[null,"14","数字媒体艺术设计","永安职业中专学校",2,"艺术设计类"]
[null,"15","数字媒体艺术设计","闽清职业中专学校",10,"艺术设计类"]
["泉州工艺美术职业学院\n（公办高职院校）\n学校代码：50014","01","电子商务","德化职业技术学校",90]
[null,"02","休闲服务与管理","德化职业技术学校",40]
[null,"03","艺术设计","德化职业技术学校",90,"艺术设计类"]
[null,"04","视觉传达设计","福建经贸学校",40,"艺术设计类"]
[null,"05","视觉传达设计","德化职业技术学校",80,"艺术设计类"]
[null,"06","数字媒体艺术设计","福建经贸学校",40,"艺术设计类"]
[null,"07","数字媒体艺术设计","惠安职业中专学校",40,"艺术设计类"]
[null,"08","工艺美术品设计","惠安开成职业中专学校",40,"艺术设计类"]
["泉州纺织服装职业学院\n（民办高职院校）\n学校代码：50015\n收费：所有专业前三年6000元/学年；后两年电子商务、服装设计与工艺、服装与服饰设计、社会体育专业13800元/学年，环境艺术设计、室内艺术设计、人物形象设计专业14800元/学年，护理专业15800元/学年。","01","服装设计与工艺","自办",55]
[null,"02","护理","自办",61]
[null,"03","电子商务","自办",74]
[null,"04","服装与服饰设计","自办",74,"艺术设计类"]
[null,"05","环境艺术设计","自办",71,"艺术设计类"]
[null,"06","室内艺术设计","自办",70,"艺术设计类"]
[null,"07","人物形象设计","自办",70,"艺术设计类"]
[null,"08","社会体育","自办",71,"体育类"]
["泉州华光职业学院\n（民办高职院校）\n学校代码：50016\n收费：自办的专业前三年6500元/学年，其中服装与服饰设计专业后两年12800元/学年，摄影与摄像艺术、休闲体育专业后两年13800元/学年，表演艺术、广告艺术设计、室内艺术设计、学前教育专业后两年14800元/学年；联办的休闲体育专业前三年4600元/学年，后两年13800元/学年；联办的其他专业前三年免学费，电子商务专业后两年12800元/学年，学前教育、建筑室内设计、广告艺术设计专业后两年14800元/学年。","01","建筑室内设计","惠安职业中专学校",50]
[null,"02","电子商务","惠安开成职业中专学校",50]
[null,"03","服装与服饰设计","自办",56,"艺术设计类"]
[null,"04","广告艺术设计","自办",85,"艺术设计类"]
[null,"05","广告艺术设计","安溪华侨职业中专学校",50,"艺术设计类"]
[null,"06","室内艺术设计","自办",87,"艺术设计类"]
[null,"07","摄影与摄像艺术","自办",87,"艺术设计类"]
[null,"08","表演艺术","自办",58,"表演艺术类"]
{"$rows_left_out":179}
{"sheet":"分校计划安排表","index":1,"n_rows":48,"n_cols":6,"rows_kept":48,"hidden":true,"merged":[[1,0,1,5],[3,0,3,1]]}
["附件1"]
["2023年福建省五年制高等职业教育招生分校计划安排表"]
["序号","学校名称","申报计划数","拟下达计划数","比申报数减少数","备注"]
["合计",null,{"$f":"SUM(C5:C48)","v":43901},{"$f":"SUM(D5:D48)","v":35121},{"$f":"SUM(E5:E48)","v":8780}]
[1,"福建船政交通职业学院",670,670,{"$f":"C5-D5","v":0}]
[2,"福建信息职业技术学院",900,900,0]
[3,"福建幼儿师范高等专科学校",160,160,0]
[4,"福建林业职业技术学院",1445,1445,0]
[5,"福建水利电力职业技术学院",1240,1240,0]
[6,"福建农业职业技术学院",720,720,0]
[7,"福建卫生职业技术学院",440,440,0]
[8,"福建生物工程职业技术学院",570,570,0]
[9,"福建艺术职业学院",255,255,0]
[10,"福建体育职业技术学院",400,400,0]
[11,"泉州幼儿师范高等专科学校",620,590,30]
[12,"闽江师范高等专科学校",775,775,0]
[13,"漳州职业技术学院",690,690,0]
[14,"闽西职业技术学院",1085,1085,0]
[15,"黎明职业大学",530,530,0]
[16,"福州职业技术学院",375,375,0]
[17,"闽北职业技术学院",1010,1010,0]
[18,"泉州经贸职业技术学院",845,845,0]
[19,"湄洲湾职业技术学院",840,840,0]
[20,"厦门城市职业学院",150,150,0]
[21,"泉州工艺美术职业学院",505,505,0]
[22,"三明医学科技职业学院",2195,2195,0]
[23,"宁德职业技术学院",876,876,0]
[24,"漳州城市职业学院",330,330,0]
[25,"漳州卫生职业学院",200,200,0]
[26,"福建华南女子职业学院",870,870,0]
[27,"福州英华职业学院",1075,1075,0]
[28,"泉州纺织服装职业学院",2000,1310,690]
[29,"泉州华光职业学院",2025,1265,760]
[30,"福州黎明职业技术学院",435,435,0]
[31,"厦门演艺职业学院",1500,750,750]
[32,"厦门华天涉外职业技术学院",1000,460,540]
[33,"福州软件职业技术学院",745,745,0]
[34,"厦门兴才职业技术学院",325,325,0]
[35,"厦门软件职业技术学院",1180,660,520]
[36,"厦门南洋职业学院",4690,1611,3079]
[37,"厦门东海职业技术学院",730,630,100]
[38,"漳州科技职业学院",1330,1320,10]
[39,"漳州理工职业学院",2065,1664,401]
[40,"武夷山职业学院",1800,940,860]
[41,"泉州海洋职业学院",1430,950,480]
[42,"泉州轻工职业学院",925,925,0]
[43,"厦门安防科技职业学院",1800,1240,560]
[44,"泉州工程职业技术学院",150,150,0]

{"sheet":"倾斜专业","index":2,"n_rows":11,"n_cols":9,"rows_kept":11,"hidden":true}
["学校名称","专业代码","专业名称","“三二分段制”中职学校名称","2022年是否倾斜专业","年度","申报数","关联项","2023是否倾斜"]
["福建体育职业技术学院","570303","运动训练","自办","否",2022,400,{"$f":"A2&C2&D2","v":"福建体育职业技术学院运动训练自办"},"是"]
["三明医学科技职业学院","520201","护理","自办","否",2022,160,{"$f":"A3&C3&D3","v":"三明医学科技职业学院护理自办"},"是"]
["泉州纺织服装职业学院","520802","婴幼儿托育服务与管理","漳州市交通职业技术学校","否",2022,200,"泉州纺织服装职业学院婴幼儿托育服务与管理漳州市交通职业技术学校","是"]
["泉州纺织服装职业学院","520802","婴幼儿托育服务与管理","自办","否",2022,200,"泉州纺织服装职业学院婴幼儿托育服务与管理自办","是"]
["厦门南洋职业学院","520802","婴幼儿托育服务与管理","自办","否",2022,400,"厦门南洋职业学院婴幼儿托育服务与管理自办","是"]
["厦门南洋职业学院","590301","现代家政服务与管理","自办","否",2022,400,"厦门南洋职业学院现代家政服务与管理自办","是"]
["泉州海洋职业学院","500301","航海技术","自办","否",2022,200,"泉州海洋职业学院航海技术自办","是"]
["泉州海洋职业学院","500303","轮机工程技术","自办","否",2022,200,"泉州海洋职业学院轮机工程技术自办","是"]
["厦门安防科技职业学院","440406","建筑消防技术","自办","否",2022,200,"厦门安防科技职业学院建筑消防技术自办","是"]
["厦门安防科技职业学院","520802","婴幼儿托育服务与管理","自办","否",2022,200,"厦门安防科技职业学院婴幼儿托育服务与管理自办","是"]

{"sheet":"职成处公布专业名单","index":3,"n_rows":605,"n_cols":12,"rows_kept":605,"hidden":true}
["序号","高职院校名称","高职专业代码","高职专业名称","办学形式","联办中职学校名称","联办/衔接中职专业名称","中职专业代码","连接项",null,"反向查询"]
[1,"福建船政交通职业学院",440502,"建设工程管理","联办","福建建筑学校","建筑工程施工",640301,{"$f":"CONCATENATE(B2,C2,F2)","v":"福建船政交通职业学院440502福建建筑学校"},"是",{"$f":"VLOOKUP(I2,#REF!,2,0)","v":{"$error":"#REF!"}}]
[2,"福建船政交通职业学院",440502,"建设工程管理","联办","闽清职业中专学校","建筑工程施工",640301,{"$f":"CONCATENATE(B3,C3,F3)","v":"福建船政交通职业学院440502闽清职业中专学校"},"是",{"$f":"VLOOKUP(I3,#REF!,2,0)","v":{"$error":"#REF!"}}]
[3,"福建船政交通职业学院",460104,"机械制造及自动化","联办","厦门市海沧区职业中专学校","机械加工技术",660102,"福建船政交通职业学院460104厦门市海沧区职业中专学校","是",{"$f":"VLOOKUP(I4,#REF!,2,0)","v":{"$error":"#REF!"}}]
[4,"福建船政交通职业学院",460701,"汽车制造与试验技术","联办","闽清职业中专学校","汽车运用与维修",700206,"福建船政交通职业学院460701闽清职业中专学校","是",{"$f":"VLOOKUP(I5,#REF!,2,0)","v":{"$error":"#REF!"}}]
[5,"福建船政交通职业学院",460701,"汽车制造与试验技术","联办","顺昌中等职业学校","汽车运用与维修",700206,"福建船政交通职业学院460701顺昌中等职业学校","是",{"$f":"VLOOKUP(I6,#REF!,2,0)","v":{"$error":"#REF!"}}]
[6,"福建船政交通职业学院",460701,"汽车制造与试验技术","联办","古田职业中专学校","汽车运用与维修",700206,"福建船政交通职业学院460701古田职业中专学校","是",{"$f":"VLOOKUP(I7,#REF!,2,0)","v":{"$error":"#REF!"}}]
[7,"福建船政交通职业学院",500211,"汽车检测与维修技术","联办","福建理工学校","汽车运用与维修",700206,"福建船政交通职业学院500211福建理工学校","是",{"$f":"VLOOKUP(I8,#REF!,2,0)","v":{"$error":"#REF!"}}]
[8,"福建船政交通职业学院",500211,"汽车检测与维修技术","联办","福建工业学校","汽车运用与维修",700206,"福建船政交通职业学院500211福建工业学校","是",{"$f":"VLOOKUP(I9,#REF!,2,0)","v":{"$error":"#REF!"}}]
[9,"福建船政交通职业学院",500303,"轮机工程技术","联办","福建航运学校","轮机维护与管理",700303,"福建船政交通职业学院500303福建航运学校","是",{"$f":"VLOOKUP(I10,#REF!,2,0)","v":{"$error":"#REF!"}}]
[10,"福建船政交通职业学院",500303,"轮机工程技术","联办","武平职业中专学校","制冷和空调设备运行与维护",660205,"福建船政交通职业学院500303武平职业中专学校","是",{"$f":"VLOOKUP(I11,#REF!,2,0)","v":{"$error":"#REF!"}}]
[11,"福建船政交通职业学院",530701,"电子商务","联办","福建省邮电学校","电子商务",730701,"福建船政交通职业学院530701福建省邮电学校","是",{"$f":"VLOOKUP(I12,#REF!,2,0)","v":{"$error":"#REF!"}}]
[12,"福建船政交通职业学院",530701,"电子商务","联办","厦门市海沧区职业中专学校","电子商务",730701,"福建船政交通职业学院530701厦门市海沧区职业中专学校","是",{"$f":"VLOOKUP(I13,#REF!,2,0)","v":{"$error":"#REF!"}}]
[13,"福建信息职业技术学院",420304,"摄影测量与遥感技术","联办","福州建筑工程职业中专学校","工程测量技术",620301,"福建信息职业技术学院420304福州建筑工程职业中专学校","是",{"$f":"VLOOKUP(I14,#REF!,2,0)","v":{"$error":"#REF!"}}]
[14,"福建信息职业技术学院",440102,"建筑装饰工程技术","联办","福建建筑学校","建筑装饰技术",640102,"福建信息职业技术学院440102福建建筑学校","是",{"$f":"VLOOKUP(I15,#REF!,2,0)","v":{"$error":"#REF!"}}]
[15,"福建信息职业技术学院",460104,"机械制造及自动化","联办","建瓯职业中专学校","数控技术应用",660103,"福建信息职业技术学院460104建瓯职业中专学校","是",{"$f":"VLOOKUP(I16,#REF!,2,0)","v":{"$error":"#REF!"}}]
[16,"福建信息职业技术学院",460305,"工业机器人技术","联办","福建工业学校","工业机器人技术应用",660303,"福建信息职业技术学院460305福建工业学校","是",{"$f":"VLOOKUP(I17,#REF!,2,0)","v":{"$error":"#REF!"}}]
[17,"福建信息职业技术学院",500211,"汽车检测与维修技术","联办","厦门市集美职业技术学校","汽车制造与检测",660701,"福建信息职业技术学院500211厦门市集美职业技术学校","是",{"$f":"VLOOKUP(I18,#REF!,2,0)","v":{"$error":"#REF!"}}]
[18,"福建信息职业技术学院",500304,"国际邮轮乘务管理","联办","福州旅游职业中专学校","邮轮乘务",700304,"福建信息职业技术学院500304福州旅游职业中专学校","是",{"$f":"VLOOKUP(I19,#REF!,2,0)","v":{"$error":"#REF!"}}]
[19,"福建信息职业技术学院",510101,"电子信息工程技术","联办","福建技术师范学院附属龙华职业技术学校","电子技术应用",710103,"福建信息职业技术学院510101福建技术师范学院附属龙华职业技术学校","是",{"$f":"VLOOKUP(I20,#REF!,2,0)","v":{"$error":"#REF!"}}]
[20,"福建信息职业技术学院",510101,"电子信息工程技术","联办","平潭职业中专学校","电子信息技术",710101,"福建信息职业技术学院510101平潭职业中专学校","是",{"$f":"VLOOKUP(I21,#REF!,2,0)","v":{"$error":"#REF!"}}]
[21,"福建信息职业技术学院",510101,"电子信息工程技术","联办","福建经济学校","计算机与数码设备维修",710211,"福建信息职业技术学院510101福建经济学校","是",{"$f":"VLOOKUP(I22,#REF!,2,0)","v":{"$error":"#REF!"}}]
[22,"福建信息职业技术学院",510102,"物联网应用技术","联办","福州机电工程职业技术学校","物联网技术应用",710102,"福建信息职业技术学院510102福州机电工程职业技术学校","是",{"$f":"VLOOKUP(I23,#REF!,2,0)","v":{"$error":"#REF!"}}]
[23,"福建信息职业技术学院",510102,"物联网应用技术","联办","福建经济学校","物联网技术应用",710102,"福建信息职业技术学院510102福建经济学校","是",{"$f":"VLOOKUP(I24,#REF!,2,0)","v":{"$error":"#REF!"}}]
[24,"福建信息职业技术学院",510207,"信息安全技术应用","联办","永安职业中专学校","计算机应用",710201,"福建信息职业技术学院510207永安职业中专学校","是",{"$f":"VLOOKUP(I25,#REF!,2,0)","v":{"$error":"#REF!"}}]
[25,"福建信息职业技术学院",510301,"现代通信技术","联办","福建省邮电学校","现代通信技术应用",710301,"福建信息职业技术学院510301福建省邮电学校","是",{"$f":"VLOOKUP(I26,#REF!,2,0)","v":{"$error":"#REF!"}}]
[26,"福建信息职业技术学院",530302,"大数据与会计","联办","三明工贸学校","会计事务",730301,"福建信息职业技术学院530302三明工贸学校","是",{"$f":"VLOOKUP(I27,#REF!,2,0)","v":{"$error":"#REF!"}}]
[27,"福建信息职业技术学院",530701,"电子商务","联办","福州商贸职业中专学校","电子商务",730701,"福建信息职业技术学院530701福州商贸职业中专学校","是",{"$f":"VLOOKUP(I28,#REF!,2,0)","v":{"$error":"#REF!"}}]
[28,"福建信息职业技术学院",540101,"旅游管理","联办","平潭职业中专学校","旅游服务与管理",740101,"福建信息职业技术学院540101平潭职业中专学校","是",{"$f":"VLOOKUP(I29,#REF!,2,0)","v":{"$error":"#REF!"}}]
[29,"福建信息职业技术学院",540113,"休闲服务与管理","联办","龙岩华侨职业中专学校","旅游服务与管理",740101,"福建信息职业技术学院540113龙岩华侨职业中专学校","是",{"$f":"VLOOKUP(I30,#REF!,2,0)","v":{"$error":"#REF!"}}]
[30,"福建水利电力职业技术学院",430108,"供用电技术","联办","三明工贸学校","电子电器应用与维修",710105,"福建水利电力职业技术学院430108三明工贸学校","是",{"$f":"VLOOKUP(I31,#REF!,2,0)","v":{"$error":"#REF!"}}]
[31,"福建水利电力职业技术学院",430108,"供用电技术","联办","福建铁路机电学校","电气化铁道供电",700105,"福建水利电力职业技术学院430108福建铁路机电学校","是",{"$f":"VLOOKUP(I32,#REF!,2,0)","v":{"$error":"#REF!"}}]
[32,"福建水利电力职业技术学院",430108,"供用电技术","联办","福建工业学校","电气设备运行与控制",660302,"福建水利电力职业技术学院430108福建工业学校","是",{"$f":"VLOOKUP(I33,#REF!,2,0)","v":{"$error":"#REF!"}}]
[33,"福建水利电力职业技术学院",440601,"市政工程技术","联办","永安职业中专学校","建筑工程施工",640301,"福建水利电力职业技术学院440601永安职业中专学校","是",{"$f":"VLOOKUP(I34,#REF!,2,0)","v":{"$error":"#REF!"}}]
[34,"福建水利电力职业技术学院",440601,"市政工程技术","联办","南靖第一职业技术学校","建筑工程施工",640301,"福建水利电力职业技术学院440601南靖第一职业技术学校","是",{"$f":"VLOOKUP(I35,#REF!,2,0)","v":{"$error":"#REF!"}}]
[35,"福建水利电力职业技术学院",440601,"市政工程技术","联办","厦门市翔安职业技术学校","建筑工程施工",640301,"福建水利电力职业技术学院440601厦门市翔安职业技术学校","是",{"$f":"VLOOKUP(I36,#REF!,2,0)","v":{"$error":"#REF!"}}]
[36,"福建水利电力职业技术学院",450204,"水利水电工程智能管理","联办","永安职业中专学校","建筑工程施工",640301,"福建水利电力职业技术学院450204永安职业中专学校","是",{"$f":"VLOOKUP(I37,#REF!,2,0)","v":{"$error":"#REF!"}}]
[37,"福建水利电力职业技术学院",450301,"水电站设备安装与管理","联办","建瓯职业中专学校","电子技术应用",710103,"福建水利电力职业技术学院450301建瓯职业中专学校","是",{"$f":"VLOOKUP(I38,#REF!,2,0)","v":{"$error":"#REF!"}}]
[38,"福建水利电力职业技术学院",460301,"机电一体化技术","联办","福建理工学校","机电技术应用",660301,"福建水利电力职业技术学院460301福建理工学校","是",{"$f":"VLOOKUP(I39,#REF!,2,0)","v":{"$error":"#REF!"}}]
[39,"福建水利电力职业技术学院",460301,"机电一体化技术","联办","厦门信息学校","机电技术应用",660301,"福建水利电力职业技术学院460301厦门信息学校","是",{"$f":"VLOOKUP(I40,#REF!,2,0)","v":{"$error":"#REF!"}}]
[40,"福建水利电力职业技术学院",460303,"智能控制技术","联办","闽清职业中专学校","电子技术应用",710103,"福建水利电力职业技术学院460303闽清职业中专学校","是",{"$f":"VLOOKUP(I41,#REF!,2,0)","v":{"$error":"#REF!"}}]
[41,"福建水利电力职业技术学院",460306,"电气自动化技术","联办","三明市农业学校","电气设备运行与控制",660302,"福建水利电力职业技术学院460306三明市农业学校","是",{"$f":"VLOOKUP(I42,#REF!,2,0)","v":{"$error":"#REF!"}}]
[42,"福建水利电力职业技术学院",460306,"电气自动化技术","联办","福建理工学校","机电技术应用",660301,"福建水利电力职业技术学院460306福建理工学校","是",{"$f":"VLOOKUP(I43,#REF!,2,0)","v":{"$error":"#REF!"}}]
[43,"福建水利电力职业技术学院",460306,"电气自动化技术","联办","南安职业中专学校","电子技术应用",710103,"福建水利电力职业技术学院460306南安职业中专学校","是",{"$f":"VLOOKUP(I44,#REF!,2,0)","v":{"$error":"#REF!"}}]
[44,"福建水利电力职业技术学院",460701,"汽车制造与试验技术","联办","大田职业中专学校","汽车运用与维修",700206,"福建水利电力职业技术学院460701大田职业中专学校","是",{"$f":"VLOOKUP(I45,#REF!,2,0)","v":{"$error":"#REF!"}}]
[45,"福建水利电力职业技术学院",460702,"新能源汽车技术","联办","集美工业学校","汽车运用与维修",700206,"福建水利电力职业技术学院460702集美工业学校","是",{"$f":"VLOOKUP(I46,#REF!,2,0)","v":{"$error":"#REF!"}}]
[46,"福建水利电力职业技术学院",460702,"新能源汽车技术","联办","厦门工商旅游学校","新能源汽车运用与维修",700209,"福建水利电力职业技术学院460702厦门工商旅游学校","是",{"$f":"VLOOKUP(I47,#REF!,2,0)","v":{"$error":"#REF!"}}]
[47,"福建水利电力职业技术学院",460702,"新能源汽车技术","联办","龙岩华侨职业中专学校","汽车运用与维修",700206,"福建水利电力职业技术学院460702龙岩华侨职业中专学校","是",{"$f":"VLOOKUP(I48,#REF!,2,0)","v":{"$error":"#REF!"}}]
[48,"福建水利电力职业技术学院",500201,"道路与桥梁工程技术","联办","福建三明林业学校","建筑工程施工",640301,"福建水利电力职业技术学院500201福建三明林业学校","是",{"$f":"VLOOKUP(I49,#REF!,2,0)","v":{"$error":"#REF!"}}]
[49,"福建水利电力职业技术学院",510101,"电子信息工程技术","联办","厦门市海沧区职业中专学校","电子技术应用",710103,"福建水利电力职业技术学院510101厦门市海沧区职业中专学校","是",{"$f":"VLOOKUP(I50,#REF!,2,0)","v":{"$error":"#REF!"}}]
[50,"福建水利电力职业技术学院",510101,"电子信息工程技术","联办","福建铁路机电学校","现代通信技术应用",710301,"福建水利电力职业技术学院510101福建铁路机电学校","是",{"$f":"VLOOKUP(I51,#REF!,2,0)","v":{"$error":"#REF!"}}]
[51,"福建水利电力职业技术学院",510201,"计算机应用技术","联办","平潭职业中专学校","计算机应用",710201,"福建水利电力职业技术学院510201平潭职业中专学校","是",{"$f":"VLOOKUP(I52,#REF!,2,0)","v":{"$error":"#REF!"}}]
[52,"福建水利电力职业技术学院",510204,"数字媒体技术","联办","三明工贸学校","计算机应用",710201,"福建水利电力职业技术学院510204三明工贸学校","是",{"$f":"VLOOKUP(I53,#REF!,2,0)","v":{"$error":"#REF!"}}]
[53,"福建水利电力职业技术学院",530701,"电子商务","联办","福建经济学校","电子商务",730701,"福建水利电力职业技术学院530701福建经济学校","是",{"$f":"VLOOKUP(I54,#REF!,2,0)","v":{"$error":"#REF!"}}]
[54,"福建水利电力职业技术学院",530701,"电子商务","联办","福建经贸学校","电子商务",730701,"福建水利电力职业技术学院530701福建经贸学校","是",{"$f":"VLOOKUP(I55,#REF!,2,0)","v":{"$error":"#REF!"}}]
[55,"福建水利电力职业技术学院",550106,"环境艺术设计","联办","厦门信息学校","建筑装饰技术",640102,"福建水利电力职业技术学院550106厦门信息学校","是",{"$f":"VLOOKUP(I56,#REF!,2,0)","v":{"$error":"#REF!"}}]
[56,"福建水利电力职业技术学院",550106,"环境艺术设计","联办","福建第二轻工业学校","工艺美术",750106,"福建水利电力职业技术学院550106福建第二轻工业学校","是",{"$f":"VLOOKUP(I57,#REF!,2,0)","v":{"$error":"#REF!"}}]
[57,"福建水利电力职业技术学院",550106,"环境艺术设计","联办","惠安开成职业中专学校","建筑装饰技术",640102,"福建水利电力职业技术学院550106惠安开成职业中专学校","是",{"$f":"VLOOKUP(I58,#REF!,2,0)","v":{"$error":"#REF!"}}]
[58,"福建林业职业技术学院",410201,"林业技术","联办","福建三明林业学校","林业生产技术",610201,"福建林业职业技术学院410201福建三明林业学校","是",{"$f":"VLOOKUP(I59,#REF!,2,0)","v":{"$error":"#REF!"}}]
[59,"福建林业职业技术学院",410202,"园林技术","联办","南平市农业学校","园林技术",610202,"福建林业职业技术学院410202南平市农业学校","是",{"$f":"VLOOKUP(I60,#REF!,2,0)","v":{"$error":"#REF!"}}]
{"$rows_left_out":546}
{"sheet":"职成处公布院校名单","index":4,"n_rows":45,"n_cols":3,"rows_kept":45,"hidden":true}
["高职院校名称","高职专业名称","报送情况"]
["福建船政交通职业学院",12,{"$f":"IFERROR(VLOOKUP(A2,#REF!,1,0),\"未报送\")","v":"未报送"}]
["福建华南女子职业学院",20,{"$f":"IFERROR(VLOOKUP(A3,#REF!,1,0),\"未报送\")","v":"未报送"}]
["福建林业职业技术学院",29,{"$f":"IFERROR(VLOOKUP(A4,#REF!,1,0),\"未报送\")","v":"未报送"}]
["福建农业职业技术学院",18,{"$f":"IFERROR(VLOOKUP(A5,#REF!,1,0),\"未报送\")","v":"未报送"}]
["福建生物工程职业技术学院",13,{"$f":"IFERROR(VLOOKUP(A6,#REF!,1,0),\"未报送\")","v":"未报送"}]
["福建水利电力职业技术学院",28,{"$f":"IFERROR(VLOOKUP(A7,#REF!,1,0),\"未报送\")","v":"未报送"}]
["福建体育职业技术学院",1,{"$f":"IFERROR(VLOOKUP(A8,#REF!,1,0),\"未报送\")","v":"未报送"}]
["福建卫生职业技术学院",8,{"$f":"IFERROR(VLOOKUP(A9,#REF!,1,0),\"未报送\")","v":"未报送"}]
["福建信息职业技术学院",17,{"$f":"IFERROR(VLOOKUP(A10,#REF!,1,0),\"未报送\")","v":"未报送"}]
["福建艺术职业学院",6,{"$f":"IFERROR(VLOOKUP(A11,#REF!,1,0),\"未报送\")","v":"未报送"}]
["福建幼儿师范高等专科学校",3,{"$f":"IFERROR(VLOOKUP(A12,#REF!,1,0),\"未报送\")","v":"未报送"}]
["福州黎明职业技术学院",10,{"$f":"IFERROR(VLOOKUP(A13,#REF!,1,0),\"未报送\")","v":"未报送"}]
["福州软件职业技术学院",15,{"$f":"IFERROR(VLOOKUP(A14,#REF!,1,0),\"未报送\")","v":"未报送"}]
["福州英华职业学院",21,{"$f":"IFERROR(VLOOKUP(A15,#REF!,1,0),\"未报送\")","v":"未报送"}]
["福州职业技术学院",13,{"$f":"IFERROR(VLOOKUP(A16,#REF!,1,0),\"未报送\")","v":"未报送"}]
["黎明职业大学",15,{"$f":"IFERROR(VLOOKUP(A17,#REF!,1,0),\"未报送\")","v":"未报送"}]
["湄洲湾职业技术学院",16,{"$f":"IFERROR(VLOOKUP(A18,#REF!,1,0),\"未报送\")","v":"未报送"}]
["闽北职业技术学院",21,{"$f":"IFERROR(VLOOKUP(A19,#REF!,1,0),\"未报送\")","v":"未报送"}]
["闽江师范高等专科学校",18,{"$f":"IFERROR(VLOOKUP(A20,#REF!,1,0),\"未报送\")","v":"未报送"}]
["闽西职业技术学院",19,{"$f":"IFERROR(VLOOKUP(A21,#REF!,1,0),\"未报送\")","v":"未报送"}]
["宁德职业技术学院",17,{"$f":"IFERROR(VLOOKUP(A22,#REF!,1,0),\"未报送\")","v":"未报送"}]
["泉州纺织服装职业学院",10,{"$f":"IFERROR(VLOOKUP(A23,#REF!,1,0),\"未报送\")","v":"未报送"}]
["泉州工程职业技术学院",3,{"$f":"IFERROR(VLOOKUP(A24,#REF!,1,0),\"未报送\")","v":"未报送"}]
["泉州工艺美术职业学院",8,{"$f":"IFERROR(VLOOKUP(A25,#REF!,1,0),\"未报送\")","v":"未报送"}]
["泉州海洋职业学院",13,{"$f":"IFERROR(VLOOKUP(A26,#REF!,1,0),\"未报送\")","v":"未报送"}]
["泉州华光职业学院",16,{"$f":"IFERROR(VLOOKUP(A27,#REF!,1,0),\"未报送\")","v":"未报送"}]
["泉州经贸职业技术学院",18,{"$f":"IFERROR(VLOOKUP(A28,#REF!,1,0),\"未报送\")","v":"未报送"}]
["泉州轻工职业学院",20,{"$f":"IFERROR(VLOOKUP(A29,#REF!,1,0),\"未报送\")","v":"未报送"}]
["泉州幼儿师范高等专科学校",14,{"$f":"IFERROR(VLOOKUP(A30,#REF!,1,0),\"未报送\")","v":"未报送"}]
["三明医学科技职业学院",43,{"$f":"IFERROR(VLOOKUP(A31,#REF!,1,0),\"未报送\")","v":"未报送"}]
["厦门安防科技职业学院",11,{"$f":"IFERROR(VLOOKUP(A32,#REF!,1,0),\"未报送\")","v":"未报送"}]
["厦门城市职业学院",3,{"$f":"IFERROR(VLOOKUP(A33,#REF!,1,0),\"未报送\")","v":"未报送"}]
["厦门东海职业技术学院",8,{"$f":"IFERROR(VLOOKUP(A34,#REF!,1,0),\"未报送\")","v":"未报送"}]
["厦门华天涉外职业技术学院",4,{"$f":"IFERROR(VLOOKUP(A35,#REF!,1,0),\"未报送\")","v":"未报送"}]
["厦门南洋职业学院",15,{"$f":"IFERROR(VLOOKUP(A36,#REF!,1,0),\"未报送\")","v":"未报送"}]
["厦门软件职业技术学院",8,{"$f":"IFERROR(VLOOKUP(A37,#REF!,1,0),\"未报送\")","v":"未报送"}]
["厦门兴才职业技术学院",7,{"$f":"IFERROR(VLOOKUP(A38,#REF!,1,0),\"未报送\")","v":"未报送"}]
["厦门演艺职业学院",5,{"$f":"IFERROR(VLOOKUP(A39,#REF!,1,0),\"未报送\")","v":"未报送"}]
["武夷山职业学院",7,{"$f":"IFERROR(VLOOKUP(A40,#REF!,1,0),\"未报送\")","v":"未报送"}]
["漳州城市职业学院",8,{"$f":"IFERROR(VLOOKUP(A41,#REF!,1,0),\"未报送\")","v":"未报送"}]
["漳州科技职业学院",20,{"$f":"IFERROR(VLOOKUP(A42,#REF!,1,0),\"未报送\")","v":"未报送"}]
["漳州理工职业学院",17,{"$f":"IFERROR(VLOOKUP(A43,#REF!,1,0),\"未报送\")","v":"未报送"}]
["漳州卫生职业学院",4,{"$f":"IFERROR(VLOOKUP(A44,#REF!,1,0),\"未报送\")","v":"未报送"}]
["漳州职业技术学院",19,{"$f":"IFERROR(VLOOKUP(A45,#REF!,1,0),\"未报送\")","v":"未报送"}]

{"sheet":"学校序号","index":5,"n_rows":95,"n_cols":2,"rows_kept":95,"hidden":true}
["学校名称","序号"]
["全省合计",1]
["本科合计",2]
["公办本科",3]
["福州大学",4]
["福建师范大学",5]
["福建农林大学",6]
["福建医科大学",7]
["福建中医药大学",8]
["集美大学",9]
["闽南师范大学",10]
["福建工程学院",11]
["厦门理工学院",12]
["闽江学院",13]
["泉州师范学院",14]
["福建江夏学院",15]
["福建警察学院",16]
["福建技术师范学院",17]
["莆田学院",18]
["龙岩学院",19]
["三明学院",20]
["武夷学院",21]
["宁德师范学院",22]
["福建商学院",23]
["厦门医学院",24]
["民办本科",25]
["仰恩大学",26]
["闽南理工学院",27]
["福州外语外贸学院",28]
["泉州信息工程学院",29]
["厦门工学院",30]
["阳光学院",31]
["厦门华厦学院",32]
["福州理工学院",33]
["闽南科技学院",34]
["福州工商学院",35]
["泉州职业技术大学",36]
["独立学院",37]
["厦门大学嘉庚学院",38]
["福州大学至诚学院",39]
["福建师范大学协和学院",40]
["福建农林大学金山学院",41]
["集美大学诚毅学院",42]
["专科合计",43]
["公办专科",44]
["福建船政交通职业学院",45]
["福建信息职业技术学院",46]
["福建幼儿师范高等专科学校",47]
["福建林业职业技术学院",48]
["福建水利电力职业技术学院",49]
["福建电力职业技术学院",50]
["厦门海洋职业技术学院",51]
["福建农业职业技术学院",52]
["福建卫生职业技术学院",53]
["福建生物工程职业技术学院",54]
["福建艺术职业学院",55]
["福建体育职业技术学院",56]
["泉州医学高等专科学校",57]
["泉州幼儿师范高等专科学校",58]
["闽江师范高等专科学校",59]
{"$rows_left_out":36}
{"sheet":"专业超400","index":6,"n_rows":369,"n_cols":3,"rows_kept":369,"hidden":true}
["甲","丙","求和项:1"]
["福建船政交通职业学院","电子商务",150]
["福建船政交通职业学院","机械制造及自动化",100]
["福建船政交通职业学院","建设工程管理",100]
["福建船政交通职业学院","轮机工程技术",90]
["福建船政交通职业学院","汽车检测与维修技术",110]
["福建船政交通职业学院","汽车制造与试验技术",120]
["福建华南女子职业学院","服装与服饰设计",110]
["福建华南女子职业学院","工程造价",105]
["福建华南女子职业学院","空中乘务",100]
["福建华南女子职业学院","旅游管理",30]
["福建华南女子职业学院","人物形象设计",80]
["福建华南女子职业学院","食品检验检测技术",50]
["福建华南女子职业学院","数字媒体艺术设计",145]
["福建华南女子职业学院","现代家政服务与管理",50]
["福建华南女子职业学院","学前教育",150]
["福建华南女子职业学院","智慧健康养老服务与管理",50]
["福建林业职业技术学院","道路与桥梁工程技术",100]
["福建林业职业技术学院","风景园林设计",150]
["福建林业职业技术学院","广告艺术设计",100]
["福建林业职业技术学院","会计信息管理",100]
["福建林业职业技术学院","机电一体化技术",150]
["福建林业职业技术学院","计算机应用技术",200]
["福建林业职业技术学院","建筑室内设计",150]
["福建林业职业技术学院","建筑智能化工程技术",100]
["福建林业职业技术学院","林业技术",50]
["福建林业职业技术学院","旅游管理",95]
["福建林业职业技术学院","市政工程技术",50]
["福建林业职业技术学院","园林工程技术",50]
["福建林业职业技术学院","园林技术",150]
["福建农业职业技术学院","宠物养护与驯导",40]
["福建农业职业技术学院","畜牧兽医",200]
["福建农业职业技术学院","金融服务与管理",160]
["福建农业职业技术学院","食品检验检测技术",40]
["福建农业职业技术学院","食品智能加工技术",120]
["福建农业职业技术学院","园林技术",160]
["福建生物工程职业技术学院","生物制药技术",80]
["福建生物工程职业技术学院","食品检验检测技术",50]
["福建生物工程职业技术学院","药品经营与管理",90]
["福建生物工程职业技术学院","药品生产技术",80]
["福建生物工程职业技术学院","药学",140]
["福建生物工程职业技术学院","医疗器械维护与管理",35]
["福建生物工程职业技术学院","中药学",95]
["福建水利电力职业技术学院","道路与桥梁工程技术",45]
["福建水利电力职业技术学院","电气自动化技术",135]
["福建水利电力职业技术学院","电子商务",90]
["福建水利电力职业技术学院","电子信息工程技术",90]
["福建水利电力职业技术学院","供用电技术",135]
["福建水利电力职业技术学院","环境艺术设计",135]
["福建水利电力职业技术学院","机电一体化技术",90]
["福建水利电力职业技术学院","计算机应用技术",40]
["福建水利电力职业技术学院","汽车制造与试验技术",40]
["福建水利电力职业技术学院","市政工程技术",130]
["福建水利电力职业技术学院","数字媒体技术",45]
["福建水利电力职业技术学院","水电站设备安装与管理",50]
["福建水利电力职业技术学院","水利水电工程智能管理",40]
["福建水利电力职业技术学院","新能源汽车技术",135]
["福建水利电力职业技术学院","智能控制技术",40]
["福建体育职业技术学院","运动训练",400]
["福建卫生职业技术学院","护理",55]
{"$rows_left_out":309}